Target
5-hydroxytryptamine receptor 2C
Ligand
BDBM50250839
Substrate
Meas. Tech.
ChEMBL_486953 (CHEMBL1012215)
Ki
2300±n/a nM
Citation
 Hu, JFSchetz, JAKelly, MPeng, JNAng, KKFlotow, HLeong, CYNg, SBBuss, ADWilkins, SPHamann, MT New antiinfective and human 5-HT2 receptor binding natural and semisynthetic compounds from the Jamaican sponge Smenospongia aurea. J Nat Prod 65:476-80 (2002)  
Target
Name:
5-hydroxytryptamine receptor 2C
Synonyms:
5-HT-1C 5-HT1C 5-HT2C-INI 5-HTR2C 5-hydroxytryptamine receptor 2C (5-HT-2C) 5HT-1C HTR1C Serotonin (5-HT3) receptor Serotonin Receptor 2C
Type:
G Protein-Coupled Receptor (GPCR)
Mol. Mass.:
51836.79
Organism:
Homo sapiens (Human)
Description:
P28335
Residue:
458
  
Inhibitor
Name:
BDBM50250839
Synonyms:
6-bromo-2'-de-N-methylaplysinopsin CHEMBL511879
Type:
Small organic molecule
Emp. Form.:
C13H11BrN4O
Mol. Mass.:
319.157
SMILES:
CN1C(N)=NC(=Cc2c[nH]c3cc(Br)ccc23)C1=O
: