Target
Proprotein convertase subtilisin/kexin type 7
Ligand
BDBM50270067
Substrate
Meas. Tech.
ChEMBL_508167 (CHEMBL1008225)
Ki
172±n/a nM
Citation
 Shiryaev, SARemacle, AGRatnikov, BINelson, NASavinov, AYWei, GBottini, MRega, MFParent, ADesjardins, RFugere, MDay, RSabet, MPellecchia, MLiddington, RCSmith, JWMustelin, TGuiney, DGLebl, MStrongin, AY Targeting host cell furin proprotein convertases as a therapeutic strategy against bacterial toxins and viral pathogens. J Biol Chem 282:20847-53 (2007)  
Target
Name:
Proprotein convertase subtilisin/kexin type 7
Synonyms:
LPC PC7 PCSK7 Prohormone convertase PC7 Proprotein convertase subtilisin/kexin type 7 Subtilisin/kexin type 7 hPC8
Type:
PROTEIN
Mol. Mass.:
86233.43
Organism:
Homo sapiens (Human)
Description:
ChEMBL_1290739
Residue:
785
  
Inhibitor
Name:
BDBM50270067
Synonyms:
CHEMBL503520 | TPQRARRRKKRW
Type:
Small organic molecule
Emp. Form.:
C70H123N31O15
Mol. Mass.:
1638.9243
SMILES:
C[C@@H](O)[C@H](N)C(=O)N1CCC[C@H]1C(=O)N[C@@H](CCC(N)=O)C(=O)N[C@@H](CCCN=C(N)N)C(=O)N[C@@H](C)C(=O)N[C@@H](CCCN=C(N)N)C(=O)N[C@@H](CCCN=C(N)N)C(=O)N[C@@H](CCCN=C(N)N)C(=O)N[C@@H](CCCCN)C(=O)N[C@@H](CCCCN)C(=O)N[C@@H](CCCN=C(N)N)C(=O)N[C@@H](Cc1c[nH]c2ccccc12)C(O)=O
: