Target
Cytochrome P450 3A4
Ligand
BDBM50260762
Substrate
Meas. Tech.
ChEMBL_552281 (CHEMBL995611)
IC50
15849±n/a nM
Citation
 Chen, CChen, YPontillo, JGuo, ZHuang, CQWu, DMadan, AChen, TWen, JXie, QTucci, FCRowbottom, MZhu, YFWade, WSaunders, JBozigian, HStruthers, RS Potent and orally bioavailable zwitterion GnRH antagonists with low CYP3A4 inhibitory activity. Bioorg Med Chem Lett 18:3301-5 (2008)  
Target
Name:
Cytochrome P450 3A4
Synonyms:
Albendazole monooxygenase CP3A4_HUMAN CYP3A4 CYPIIIA4 Cytochrome P450 3A4 (CYP3A4) Nifedipine oxidase Taurochenodeoxycholate 6-alpha-hydroxylase
Type:
Enzyme
Mol. Mass.:
57349.57
Organism:
Homo sapiens (Human)
Description:
Residue:
503
  
Inhibitor
Name:
BDBM50260762
Synonyms:
(R)-4-(2-(3-(2-fluoro-6-(trifluoromethyl)benzyl)-5-(2-chlorophenyl)-2,6-dioxo-2,3-dihydropyrimidin-1(6H)-yl)-1-phenylethylamino)butanoic acid | CHEMBL450471
Type:
Small organic molecule
Emp. Form.:
C30H26ClF4N3O4
Mol. Mass.:
603.992
SMILES:
OC(=O)CCCN[C@@H](Cn1c(=O)c(cn(Cc2c(F)cccc2C(F)(F)F)c1=O)-c1ccccc1Cl)c1ccccc1
: