Target
Proteinase-activated receptor 1
Ligand
BDBM50261015
Substrate
Meas. Tech.
ChEMBL_556010 (CHEMBL964660)
Ki
20±n/a nM
Citation
 Chackalamannil, SWang, YGreenlee, WJHu, ZXia, YAhn, HSBoykow, GHsieh, YPalamanda, JAgans-Fantuzzi, JKurowski, SGraziano, MChintala, M Discovery of a novel, orally active himbacine-based thrombin receptor antagonist (SCH 530348) with potent antiplatelet activity. J Med Chem 51:3061-4 (2008)  
Target
Name:
Proteinase-activated receptor 1
Synonyms:
CF2R F2R PAR1 Proteinase activated receptor 1 TR Thrombin receptor/ Proteinase-activated receptor 1(Par-1)
Type:
Protein
Mol. Mass.:
47450.07
Organism:
Homo sapiens (Human)
Description:
P25116
Residue:
425
  
Inhibitor
Name:
BDBM50261015
Synonyms:
(3R,3aS,4S,4aR,7R,8aR,9aR,E)-7-amino-4-(2-(5-(3-fluorophenyl)pyridin-2-yl)vinyl)-3-methyl-decahydronaphtho[2,3-c]furan-1(3H)-one | CHEMBL498785
Type:
Small organic molecule
Emp. Form.:
C26H29FN2O2
Mol. Mass.:
420.5191
SMILES:
C[C@H]1OC(=O)[C@@H]2C[C@@H]3C[C@H](N)CC[C@H]3[C@H](\C=C\c3ccc(cn3)-c3cccc(F)c3)[C@H]12
: