Target
Lysophosphatidic acid receptor 1
Ligand
BDBM50271763
Substrate
Meas. Tech.
ChEMBL_556424 (CHEMBL955641)
Ki
50±n/a nM
Citation
 Fells, JITsukahara, RFujiwara, YLiu, JPerygin, DHOsborne, DATigyi, GParrill, AL Identification of non-lipid LPA3 antagonists by virtual screening. Bioorg Med Chem 16:6207-17 (2008)  
Target
Name:
Lysophosphatidic acid receptor 1
Synonyms:
EDG2 LPA-1 LPAR1 Lysophosphatidic acid receptor 1 (LPA1) | Lysophosphatidic acid receptor Edg-2
Type:
Enzyme
Mol. Mass.:
41120.55
Organism:
Homo sapiens (Human)
Description:
Q92633
Residue:
364
  
Inhibitor
Name:
BDBM50271763
Synonyms:
3-[3-(3-Carboxy-acryloylamino)-phenylcarbamoyl]-acrylic acid CHEMBL519002
Type:
Small organic molecule
Emp. Form.:
C14H12N2O6
Mol. Mass.:
304.2549
SMILES:
OC(=O)\C=C\C(=O)Nc1cccc(NC(=O)\C=C\C(O)=O)c1
: