Target
Lysophosphatidic acid receptor 2
Ligand
BDBM50271699
Substrate
Meas. Tech.
ChEMBL_556426 (CHEMBL955643)
IC50
>9400±n/a nM
Citation
 Fells, JITsukahara, RFujiwara, YLiu, JPerygin, DHOsborne, DATigyi, GParrill, AL Identification of non-lipid LPA3 antagonists by virtual screening. Bioorg Med Chem 16:6207-17 (2008)  
Target
Name:
Lysophosphatidic acid receptor 2
Synonyms:
EDG4 LPA-2 LPAR2 Lysophosphatidic acid receptor 2 | Lysophosphatidic acid receptor Edg-4
Type:
PROTEIN
Mol. Mass.:
39103.44
Organism:
Homo sapiens (Human)
Description:
ChEMBL_1451385
Residue:
351
  
Inhibitor
Name:
BDBM50271699
Synonyms:
7-(4-(4-aminobenzamido)benzamido)-4-hydroxynaphthalene-2-sulfonic acid | CHEMBL483302
Type:
Small organic molecule
Emp. Form.:
C24H19N3O6S
Mol. Mass.:
477.489
SMILES:
Nc1ccc(cc1)C(=O)Nc1ccc(cc1)C(=O)Nc1ccc2c(O)cc(cc2c1)S(O)(=O)=O
: