Target
Adenosine receptor A1
Ligand
BDBM50271497
Substrate
Meas. Tech.
ChEMBL_556466 (CHEMBL955683)
Ki
132±n/a nM
Citation
 Colotta, VCatarzi, DVarano, FLenzi, OFilacchioni, GMartini, CTrincavelli, LCiampi, OTraini, CPugliese, AMPedata, FMorizzo, EMoro, S Synthesis, ligand-receptor modeling studies and pharmacological evaluation of novel 4-modified-2-aryl-1,2,4-triazolo[4,3-a]quinoxalin-1-one derivatives as potent and selective human A3 adenosine receptor antagonists. Bioorg Med Chem 16:6086-102 (2008)  
Target
Name:
Adenosine receptor A1
Synonyms:
AA1R_RAT ADENOSINE A1 high Adenosine A1 receptor (A1) Adenosine receptors A1 | Adora1
Type:
Protein
Mol. Mass.:
36704.13
Organism:
Rattus norvegicus (rat)
Description:
Residue:
326
  
Inhibitor
Name:
BDBM50271497
Synonyms:
4-bismethanesulfonylamino-2-phenyl-1,2,4-triazolo[4,3-a]quinoxalin-1-one | CHEMBL519319
Type:
Small organic molecule
Emp. Form.:
C17H15N5O5S2
Mol. Mass.:
433.462
SMILES:
CS(=O)(=O)N(c1nc2ccccc2n2c1nn(-c1ccccc1)c2=O)S(C)(=O)=O
: