Target
Mu-type opioid receptor
Ligand
BDBM50163913
Substrate
Meas. Tech.
ChEMBL_556842 (CHEMBL964702)
Ki
9.35±n/a nM
Citation
 Wang, CLYao, JLYu, YShao, XCui, YLiu, HMLai, LHWang, R Structure-activity study of endomorphin-2 analogs with C-terminal modifications by NMR spectroscopy and molecular modeling. Bioorg Med Chem 16:6415-22 (2008)  
Target
Name:
Mu-type opioid receptor
Synonyms:
MOR-1 Mu-type opioid receptor (MOR) OPRM_RAT Opioid receptor B Ror-b
Type:
G Protein-Coupled Receptor (GPCR)
Mol. Mass.:
44503.11
Organism:
Rattus norvegicus (rat)
Description:
Competition binding assays were carried out using membrane preparations from transfected HN9.10 cells that constitutively expressed the mu opioid receptor.
Residue:
398
  
Inhibitor
Name:
BDBM50163913
Synonyms:
CHEMBL180777 | Tyr-Pro-Phe-Phe-NHNH2
Type:
Small organic molecule
Emp. Form.:
C32H38N6O5
Mol. Mass.:
586.6813
SMILES:
NNC(=O)[C@H](Cc1ccccc1)NC(=O)[C@H](Cc1ccccc1)NC(=O)[C@@H]1CCCN1C(=O)[C@@H](N)Cc1ccc(O)cc1
: