Target
Nitric oxide synthase, endothelial
Ligand
BDBM50270528
Substrate
Meas. Tech.
ChEMBL_552620 (CHEMBL957264)
IC50
2000±n/a nM
Citation
 Cottyn, BAcher, FRamassamy, BAlvey, LLepoivre, MFrapart, YStuehr, DMansuy, DBoucher, JLVichard, D Inhibitory effects of a series of 7-substituted-indazoles toward nitric oxide synthases: particular potency of 1H-indazole-7-carbonitrile. Bioorg Med Chem 16:5962-73 (2008)  
Target
Name:
Nitric oxide synthase, endothelial
Synonyms:
Constitutive NOS Endothelial nitric oxide synthase NOS type III NOS3_BOVIN Nitric-oxide synthase, endothelial | cNOS
Type:
Enzyme
Mol. Mass.:
133292.26
Organism:
Bos taurus (bovine)
Description:
Recombinant eNOS overexpressed in E. coli was used in enzyme assays.
Residue:
1205
  
Inhibitor
Name:
BDBM50270528
Synonyms:
3-BROMO-7-NITROINDAZOLE CHEMBL479014
Type:
Small organic molecule
Emp. Form.:
C7H4BrN3O2
Mol. Mass.:
242.03
SMILES:
[O-][N+](=O)c1cccc2c(Br)n[nH]c12
: