Target
Cannabinoid receptor 2
Ligand
BDBM50176983
Substrate
Meas. Tech.
ChEMBL_552831 (CHEMBL958036)
Ki
230±n/a nM
Citation
 Zhang, YBurgess, JPBrackeen, MGilliam, AMascarella, SWPage, KSeltzman, HHThomas, BF Conformationally constrained analogues of N-(piperidinyl)-5-(4-chlorophenyl)-1-(2,4- dichlorophenyl)-4-methyl-1H-pyrazole-3-carboxamide (SR141716): design, synthesis, computational analysis, and biological evaluations. J Med Chem 51:3526-39 (2008)  
Target
Name:
Cannabinoid receptor 2
Synonyms:
CANNABINOID CB2 CB2 CB2B CNR2_HUMAN Cannabinoid CB2 receptor Cannabinoid receptor 2 (CB2R) | hCB2
Type:
G Protein-Coupled Receptor (GPCR)
Mol. Mass.:
39690.94
Organism:
Homo sapiens (Human)
Description:
P34972
Residue:
360
  
Inhibitor
Name:
BDBM50176983
Synonyms:
7-chloro-1-(2,4-dichlorophenyl)-N-(piperidin-1-yl)-4,5-dihydro-1H-benzo[g]indazole-3-carboxamide | CHEMBL389203
Type:
Small organic molecule
Emp. Form.:
C23H21Cl3N4O
Mol. Mass.:
475.798
SMILES:
Clc1ccc(c(Cl)c1)-n1nc(C(=O)NN2CCCCC2)c2CCc3cc(Cl)ccc3-c12
: