Target
Mast/stem cell growth factor receptor Kit
Ligand
BDBM50243182
Substrate
Meas. Tech.
ChEMBL_491668 (CHEMBL946386)
IC50
77±n/a nM
Citation
 Chen, NBürli, RWNeira, SHungate, RZhang, DYu, VNguyen, YTudor, YPlant, MFlynn, SMeagher, KLLee, MRZhang, XItano, ASchrag, MXu, YNg, GYHu, E Discovery of a potent and selective c-Kit inhibitor for the treatment of inflammatory diseases. Bioorg Med Chem Lett 18:4137-41 (2008)  
Target
Name:
Mast/stem cell growth factor receptor Kit
Synonyms:
CD117 antigen KIT Mast/stem cell growth factor receptor Kit (cKIT) Proto-oncogene tyrosine-protein kinase Kit Stem cell growth factor receptor Tyrosine-protein kinase Kit c-kit v-kit Hardy-Zuckerman 4 feline sarcoma viral oncogene homolog
Type:
Protein
Mol. Mass.:
109869.37
Organism:
Homo sapiens (Human)
Description:
P10721
Residue:
976
  
Inhibitor
Name:
BDBM50243182
Synonyms:
CHEMBL487431 N3-(6-aminopyridin-3-yl)-N1-(2-cyclopentylethyl)-4-methylisophthalamide
Type:
Small organic molecule
Emp. Form.:
C21H26N4O2
Mol. Mass.:
366.4567
SMILES:
Cc1ccc(cc1C(=O)Nc1ccc(N)nc1)C(=O)NCCC1CCCC1
: