Target
Urotensin-2 receptor
Ligand
BDBM50252353
Substrate
Meas. Tech.
ChEMBL_487750 (CHEMBL1009482)
Ki
3±n/a nM
Citation
 Jin, JAn, MSapienza, AAiyar, NNaselsky, DSarau, HMFoley, JJSalyers, KLKnight, SDKeenan, RMRivero, RADhanak, DDouglas, SA Urotensin-II receptor antagonists: synthesis and SAR of N-cyclic azaalkyl benzamides. Bioorg Med Chem Lett 18:3950-4 (2008)  
Target
Name:
Urotensin-2 receptor
Synonyms:
G-protein coupled receptor 14 UR-II-R UTS2R Urotensin-II
Type:
Enzyme Catalytic Domain
Mol. Mass.:
42159.71
Organism:
Homo sapiens (Human)
Description:
Urotensin-II UTS2R HUMAN::Q9UKP6
Residue:
389
  
Inhibitor
Name:
BDBM50252353
Synonyms:
CHEMBL479413 | N-((S)-1-((S)-1-(3-bromo-4-(piperidin-4-yloxy)benzyl)pyrrolidin-3-ylamino)-4-methyl-1-oxopentan-2-yl)benzo[b]thiophene-2-carboxamide
Type:
Small organic molecule
Emp. Form.:
C31H39BrN4O3S
Mol. Mass.:
627.635
SMILES:
CC(C)C[C@H](NC(=O)c1cc2ccccc2s1)C(=O)N[C@H]1CCN(Cc2ccc(OC3CCNCC3)c(Br)c2)C1
: