Target
Lysine--tRNA ligase
Ligand
BDBM50263119
Substrate
Meas. Tech.
ChEMBL_490569 (CHEMBL981176)
IC50
83±n/a nM
Citation
 Hirabayashi, AMukaiyama, HKobayashi, HShiohara, HNakayama, SOzawa, MMiyazawa, KMisawa, KOhnota, HIsaji, M A novel Syk family kinase inhibitor: design, synthesis, and structure-activity relationship of 1,2,4-triazolo[4,3-c]pyrimidine and 1,2,4-triazolo[1,5-c]pyrimidine derivatives. Bioorg Med Chem 16:7347-57 (2008)  
Target
Name:
Lysine--tRNA ligase
Synonyms:
KARS KIAA0070 SYK_HUMAN
Type:
PROTEIN
Mol. Mass.:
68044.78
Organism:
Homo sapiens (Human)
Description:
ChEMBL_960665
Residue:
597
  
Inhibitor
Name:
BDBM50263119
Synonyms:
CHEMBL478642 | cis-5-(2-Aminocyclohexylamino)-7-(3,5-dimethoxyphenylamino)-2-phenyl-1,2,4-triazolo[1,5-c]pyrimidine-8-carboxamide
Type:
Small organic molecule
Emp. Form.:
C26H30N8O3
Mol. Mass.:
502.5682
SMILES:
COc1cc(Nc2nc(N[C@H]3CCCC[C@H]3N)n3nc(nc3c2C(N)=O)-c2ccccc2)cc(OC)c1
: