Target
D(1A) dopamine receptor
Ligand
BDBM50262790
Substrate
Meas. Tech.
ChEMBL_491034 (CHEMBL982082)
Ki
922±n/a nM
Citation
 Siracusa, MASalerno, LModica, MNPittalà, VRomeo, GAmato, MENowak, MBojarski, AJMereghetti, ICagnotto, AMennini, T Synthesis of new arylpiperazinylalkylthiobenzimidazole, benzothiazole, or benzoxazole derivatives as potent and selective 5-HT1A serotonin receptor ligands. J Med Chem 51:4529-38 (2008)  
Target
Name:
D(1A) dopamine receptor
Synonyms:
DOPAMINE D1 Dopamine D1 high Dopamine receptor Dopamine1-like Drd1a
Type:
Enzyme Catalytic Domain
Mol. Mass.:
49429.75
Organism:
RAT
Description:
P18901
Residue:
446
  
Inhibitor
Name:
BDBM50262790
Synonyms:
2-[[6-[4-(2-Methoxyphenyl)-1-piperazinyl]hexyl]thio]benzoxazole | CHEMBL476722
Type:
Small organic molecule
Emp. Form.:
C24H31N3O2S
Mol. Mass.:
425.587
SMILES:
COc1ccccc1N1CCN(CCCCCCSc2nc3ccccc3o2)CC1
: