Target
D(1A) dopamine receptor
Ligand
BDBM50262787
Substrate
Meas. Tech.
ChEMBL_491034 (CHEMBL982082)
Ki
2005±n/a nM
Citation
 Siracusa, MASalerno, LModica, MNPittalà, VRomeo, GAmato, MENowak, MBojarski, AJMereghetti, ICagnotto, AMennini, T Synthesis of new arylpiperazinylalkylthiobenzimidazole, benzothiazole, or benzoxazole derivatives as potent and selective 5-HT1A serotonin receptor ligands. J Med Chem 51:4529-38 (2008)  
Target
Name:
D(1A) dopamine receptor
Synonyms:
DOPAMINE D1 Dopamine D1 high Dopamine receptor Dopamine1-like Drd1a
Type:
Enzyme Catalytic Domain
Mol. Mass.:
49429.75
Organism:
RAT
Description:
P18901
Residue:
446
  
Inhibitor
Name:
BDBM50262787
Synonyms:
2-[[4-[4-(2-Methoxyphenyl)-1-piperazinyl]butyl]thio]benzothiazole | CHEMBL477765
Type:
Small organic molecule
Emp. Form.:
C22H27N3OS2
Mol. Mass.:
413.599
SMILES:
COc1ccccc1N1CCN(CCCCSc2nc3ccccc3s2)CC1
: