Target
D(1A) dopamine receptor
Ligand
BDBM50262639
Substrate
Meas. Tech.
ChEMBL_491034 (CHEMBL982082)
Ki
>10000±n/a nM
Citation
 Siracusa, MASalerno, LModica, MNPittalà, VRomeo, GAmato, MENowak, MBojarski, AJMereghetti, ICagnotto, AMennini, T Synthesis of new arylpiperazinylalkylthiobenzimidazole, benzothiazole, or benzoxazole derivatives as potent and selective 5-HT1A serotonin receptor ligands. J Med Chem 51:4529-38 (2008)  
Target
Name:
D(1A) dopamine receptor
Synonyms:
DOPAMINE D1 Dopamine D1 high Dopamine receptor Dopamine1-like Drd1a
Type:
Enzyme Catalytic Domain
Mol. Mass.:
49429.75
Organism:
RAT
Description:
P18901
Residue:
446
  
Inhibitor
Name:
BDBM50262639
Synonyms:
2-[[3-[4-(Pyridin-2-yl)-1-piperazinyl]propyl]thio]benzoxazole | CHEMBL517962
Type:
Small organic molecule
Emp. Form.:
C19H22N4OS
Mol. Mass.:
354.469
SMILES:
C(CSc1nc2ccccc2o1)CN1CCN(CC1)c1ccccn1
: