Target
D(2) dopamine receptor
Ligand
BDBM50262582
Substrate
Meas. Tech.
ChEMBL_491035 (CHEMBL982895)
Ki
462±n/a nM
Citation
 Siracusa, MASalerno, LModica, MNPittalà, VRomeo, GAmato, MENowak, MBojarski, AJMereghetti, ICagnotto, AMennini, T Synthesis of new arylpiperazinylalkylthiobenzimidazole, benzothiazole, or benzoxazole derivatives as potent and selective 5-HT1A serotonin receptor ligands. J Med Chem 51:4529-38 (2008)  
Target
Name:
D(2) dopamine receptor
Synonyms:
DOPAMINE D2 DOPAMINE D2 Short Dopamine D2 receptor Drd2
Type:
G Protein-Coupled Receptor (GPCR)
Mol. Mass.:
50931.60
Organism:
Rattus norvegicus (rat)
Description:
P61169
Residue:
444
  
Inhibitor
Name:
BDBM50262582
Synonyms:
2-[[3-[4-(Pyridin-2-yl)-1-piperazinyl]propyl]thio]benzothiazole | CHEMBL478413
Type:
Small organic molecule
Emp. Form.:
C19H22N4S2
Mol. Mass.:
370.535
SMILES:
C(CSc1nc2ccccc2s1)CN1CCN(CC1)c1ccccn1
: