Target
5-hydroxytryptamine receptor 2A
Ligand
BDBM50262742
Substrate
Meas. Tech.
ChEMBL_491036 (CHEMBL982896)
Ki
183±n/a nM
Citation
 Siracusa, MASalerno, LModica, MNPittalà, VRomeo, GAmato, MENowak, MBojarski, AJMereghetti, ICagnotto, AMennini, T Synthesis of new arylpiperazinylalkylthiobenzimidazole, benzothiazole, or benzoxazole derivatives as potent and selective 5-HT1A serotonin receptor ligands. J Med Chem 51:4529-38 (2008)  
Target
Name:
5-hydroxytryptamine receptor 2A
Synonyms:
5-HT-2A 5-HT2A 5-hydroxytryptamine receptor 2A (5HT2A) Htr2 Serotonin Receptor 2A
Type:
G Protein-Coupled Receptor (GPCR)
Mol. Mass.:
52852.05
Organism:
Rattus norvegicus (rat)
Description:
Rat cortex membranes 5-HT2A receptors.
Residue:
471
  
Inhibitor
Name:
BDBM50262742
Synonyms:
2-[[3-[4-(Pyrimidin-2-yl)-1-piperazinyl]propyl]thio]benzothiazole | CHEMBL479026
Type:
Small organic molecule
Emp. Form.:
C18H21N5S2
Mol. Mass.:
371.523
SMILES:
C(CSc1nc2ccccc2s1)CN1CCN(CC1)c1ncccn1
: