Target
Cytochrome P450 2D6
Ligand
BDBM50262510
Substrate
Meas. Tech.
ChEMBL_514340 (CHEMBL967954)
Ki
120±n/a nM
Citation
 Shishido, YWakabayashi, HKoike, HUeno, NNukui, SYamagishi, TMurata, YNaganeo, FMizutani, MShimada, KFujiwara, YSakakibara, ASuga, OKusano, RUeda, SKanai, YTsuchiya, MSatake, K Discovery and stereoselective synthesis of the novel isochroman neurokinin-1 receptor antagonist 'CJ-17,493'. Bioorg Med Chem 16:7193-205 (2008)  
Target
Name:
Cytochrome P450 2D6
Synonyms:
CP2D6_HUMAN CYP2DL1 Cytochrome P450 2D6 (CYP2D6) P450-DB1
Type:
Protein
Mol. Mass.:
55774.82
Organism:
Homo sapiens (Human)
Description:
P10635
Residue:
497
  
Inhibitor
Name:
BDBM50262510
Synonyms:
CHEMBL477365 R/S-(2S,3S)-N-((3-methoxy-8-methyl-8-(trifluoromethyl)-5,6,7,8-tetrahydronaphthalen-2-yl)methyl)-2-phenylpiperidin-3-amine
Type:
Small organic molecule
Emp. Form.:
C25H31F3N2O
Mol. Mass.:
432.5216
SMILES:
COc1cc2CCCC(C)(c2cc1CN[C@H]1CCCN[C@H]1c1ccccc1)C(F)(F)F
: