Target
Coagulation factor X
Ligand
BDBM50273264
Substrate
Meas. Tech.
ChEMBL_510032 (CHEMBL995175)
Ki
3500±n/a nM
Citation
 Uchida, MOkazaki, KMukaiyama, HIsawa, HKobayashi, HShiohara, HMuranaka, HKai, YKikuchi, NTakeuchi, HYokoyama, KTsuji, EOzawa, THoyano, YKoizumi, TMisawa, KHara, KNakano, SMurakami, YOkuno, H Orally active factor Xa inhibitors: investigation of a novel series of 3-amidinophenylsulfonamide derivatives using an amidoxime prodrug strategy. Bioorg Med Chem Lett 18:4682-7 (2008)  
Target
Name:
Coagulation factor X
Synonyms:
Activated coagulation factor X (FXa) Coagulation factor X precursor F10 Factor X heavy chain Factor Xa Stuart-Prower factor
Type:
Enzyme
Mol. Mass.:
54726.60
Organism:
Homo sapiens (Human)
Description:
Residue:
488
  
Inhibitor
Name:
BDBM50273264
Synonyms:
CHEMBL457632 | ethyl 2-(2-(2-(2-hydroxy-5-(N'-hydroxycarbamimidoyl)phenylsulfonamido)ethyl)-5-isopropylphenoxy)acetate
Type:
Small organic molecule
Emp. Form.:
C22H29N3O7S
Mol. Mass.:
479.547
SMILES:
CCOC(=O)COc1cc(ccc1CCNS(=O)(=O)c1cc(ccc1O)C(=N)NO)C(C)C
: