Target
Coagulation factor X
Ligand
BDBM50273228
Substrate
Meas. Tech.
ChEMBL_510032 (CHEMBL995175)
Ki
7300±n/a nM
Citation
 Uchida, MOkazaki, KMukaiyama, HIsawa, HKobayashi, HShiohara, HMuranaka, HKai, YKikuchi, NTakeuchi, HYokoyama, KTsuji, EOzawa, THoyano, YKoizumi, TMisawa, KHara, KNakano, SMurakami, YOkuno, H Orally active factor Xa inhibitors: investigation of a novel series of 3-amidinophenylsulfonamide derivatives using an amidoxime prodrug strategy. Bioorg Med Chem Lett 18:4682-7 (2008)  
Target
Name:
Coagulation factor X
Synonyms:
Activated coagulation factor X (FXa) Coagulation factor X precursor F10 Factor X heavy chain Factor Xa Stuart-Prower factor
Type:
Enzyme
Mol. Mass.:
54726.60
Organism:
Homo sapiens (Human)
Description:
Residue:
488
  
Inhibitor
Name:
BDBM50273228
Synonyms:
4,N-Dihydroxy-3-[2-(4-isopropyl-phenyl)-ethylsulfamoyl]-benzamidine | CHEMBL455915
Type:
Small organic molecule
Emp. Form.:
C18H23N3O4S
Mol. Mass.:
377.458
SMILES:
CC(C)c1ccc(CCNS(=O)(=O)c2cc(ccc2O)C(=N)NO)cc1
: