Target
Sodium-dependent dopamine transporter
Ligand
BDBM50022784
Substrate
Meas. Tech.
ChEMBL_510056 (CHEMBL995199)
IC50
3000±n/a nM
Citation
 Hudson, SKiankarimi, MEccles, WMostofi, YSGenicot, MJDwight, WFleck, BAGogas, KWade, WS Synthesis and structure-activity relationships of selective norepinephrine reuptake inhibitors (sNRI) with a heterocyclic ring constraint. Bioorg Med Chem Lett 18:4495-8 (2008)  
Target
Name:
Sodium-dependent dopamine transporter
Synonyms:
DA transporter DAT1 Dopamine transporter protein (DAT) SC6A3_HUMAN Sodium-dependent dopamine transporter Solute carrier family 6 member 3
Type:
Multi-pass membrane protein
Mol. Mass.:
68497.11
Organism:
Homo sapiens (Human)
Description:
Q01959
Residue:
620
  
Inhibitor
Name:
BDBM50022784
Synonyms:
(R)-N-methyl-3-phenyl-3-(o-tolyloxy)propan-1-amine CHEMBL641 Methyl-(3-phenyl-3-o-tolyloxy-propyl)-amine Strattera | Tomoxetine
Type:
Small organic molecule
Emp. Form.:
C17H21NO
Mol. Mass.:
255.3547
SMILES:
CNCCC(Oc1ccccc1C)c1ccccc1
: