Target
Fatty-acid amide hydrolase 1 [30-579]
Ligand
BDBM23120
Substrate
Meas. Tech.
ChEMBL_511685 (CHEMBL978248)
Ki
4.7±n/a nM
Citation
 Keith, JMApodaca, RXiao, WSeierstad, MPattabiraman, KWu, JWebb, MKarbarz, MJBrown, SWilson, SScott, BTham, CSLuo, LPalmer, JWennerholm, MChaplan, SBreitenbucher, JG Thiadiazolopiperazinyl ureas as inhibitors of fatty acid amide hydrolase. Bioorg Med Chem Lett 18:4838-43 (2008)  
Target
Name:
Fatty-acid amide hydrolase 1 [30-579]
Synonyms:
Anandamide amidohydrolase 1 Faah Fatty Acid Amide Hydrolase Fatty-acid amide hydrolase (FAAH) Fatty-acid amide hydrolase 1 (FAAH) Oleamide hydrolase 1
Type:
Single-pass membrane protein; homodimer
Mol. Mass.:
60474.00
Organism:
Rattus norvegicus (rat)
Description:
P97612 (aa 30-579)
Residue:
550
  
Inhibitor
Name:
BDBM23120
Synonyms:
7-phenyl-1-[5-(pyridin-2-yl)-1,3-oxazol-2-yl]heptan-1-one OL-135
Type:
Small organic molecule
Emp. Form.:
C21H22N2O2
Mol. Mass.:
334.4116
SMILES:
O=C(CCCCCCc1ccccc1)c1ncc(o1)-c1ccccn1
: