Target
Mitogen-activated protein kinase 14
Ligand
BDBM50252739
Substrate
Meas. Tech.
ChEMBL_539857 (CHEMBL1024853)
IC50
2.4±n/a nM
Citation
 Herberich, BCao, GQChakrabarti, PPFalsey, JRPettus, LRzasa, RMReed, ABReichelt, ASham, KThaman, MWurz, RPXu, SZhang, DHsieh, FLee, MRSyed, RLi, VGrosfeld, DPlant, MHHenkle, BSherman, LMiddleton, SWong, LMTasker, AS Discovery of highly selective and potent p38 inhibitors based on a phthalazine scaffold. J Med Chem 51:6271-9 (2008)  
Target
Name:
Mitogen-activated protein kinase 14
Synonyms:
CSAID-binding protein CSBP1 CSPB1 MAP kinase 14 MAP kinase p38 alpha MAPK14 MK14_HUMAN Mitogen-activated protein kinase p38 alpha Stress-activated protein kinase 2a | p38 MAP kinase alpha/beta
Type:
Serine/threonine-protein kinase
Mol. Mass.:
41286.76
Organism:
Homo sapiens (Human)
Description:
Q16539
Residue:
360
  
Inhibitor
Name:
BDBM50252739
Synonyms:
CHEMBL494072 N-cyclopropyl-4-methyl-3-{2-[(2-morpholin-4-ylethyl)amino]quinazolin-6-yl}benzamide
Type:
Small organic molecule
Emp. Form.:
C25H29N5O2
Mol. Mass.:
431.5301
SMILES:
Cc1ccc(cc1-c1ccc2nc(NCCN3CCOCC3)ncc2c1)C(=O)NC1CC1
: