Target
Vascular endothelial growth factor receptor 2
Ligand
BDBM50253154
Substrate
Meas. Tech.
ChEMBL_539858 (CHEMBL1024854)
IC50
>10000±n/a nM
Citation
 Herberich, BCao, GQChakrabarti, PPFalsey, JRPettus, LRzasa, RMReed, ABReichelt, ASham, KThaman, MWurz, RPXu, SZhang, DHsieh, FLee, MRSyed, RLi, VGrosfeld, DPlant, MHHenkle, BSherman, LMiddleton, SWong, LMTasker, AS Discovery of highly selective and potent p38 inhibitors based on a phthalazine scaffold. J Med Chem 51:6271-9 (2008)  
Target
Name:
Vascular endothelial growth factor receptor 2
Synonyms:
CD_antigen=CD309 Fetal liver kinase 1 (FLK-1) KDR Protein-tyrosine kinase receptor Flk-1 VEGFR-2 VEGFR2 Vascular Endothelial Growth Factor Receptor Kinase 2 Vascular endothelial growth factor receptor 2 (KDR) Vascular endothelial growth factor receptor 2 (VEGFR2) Vascular endothelial growth factor receptor-2 (VEGFR-2)
Type:
Receptor Tyrosine Kinase
Mol. Mass.:
151510.97
Organism:
Homo sapiens (Human)
Description:
P35968
Residue:
1356
  
Inhibitor
Name:
BDBM50253154
Synonyms:
CHEMBL492265 N-cyclopropyl-4-methyl-3-[1-(2-methylphenyl)phthalazin-6-yl]benzamide
Type:
Small organic molecule
Emp. Form.:
C26H23N3O
Mol. Mass.:
393.4803
SMILES:
Cc1ccccc1-c1nncc2cc(ccc12)-c1cc(ccc1C)C(=O)NC1CC1
: