Target
Mast/stem cell growth factor receptor Kit
Ligand
BDBM50253154
Substrate
Meas. Tech.
ChEMBL_539860 (CHEMBL1024856)
IC50
2944±n/a nM
Citation
 Herberich, BCao, GQChakrabarti, PPFalsey, JRPettus, LRzasa, RMReed, ABReichelt, ASham, KThaman, MWurz, RPXu, SZhang, DHsieh, FLee, MRSyed, RLi, VGrosfeld, DPlant, MHHenkle, BSherman, LMiddleton, SWong, LMTasker, AS Discovery of highly selective and potent p38 inhibitors based on a phthalazine scaffold. J Med Chem 51:6271-9 (2008)  
Target
Name:
Mast/stem cell growth factor receptor Kit
Synonyms:
CD117 antigen KIT Mast/stem cell growth factor receptor Kit (cKIT) Proto-oncogene tyrosine-protein kinase Kit Stem cell growth factor receptor Tyrosine-protein kinase Kit c-kit v-kit Hardy-Zuckerman 4 feline sarcoma viral oncogene homolog
Type:
Protein
Mol. Mass.:
109869.37
Organism:
Homo sapiens (Human)
Description:
P10721
Residue:
976
  
Inhibitor
Name:
BDBM50253154
Synonyms:
CHEMBL492265 N-cyclopropyl-4-methyl-3-[1-(2-methylphenyl)phthalazin-6-yl]benzamide
Type:
Small organic molecule
Emp. Form.:
C26H23N3O
Mol. Mass.:
393.4803
SMILES:
Cc1ccccc1-c1nncc2cc(ccc12)-c1cc(ccc1C)C(=O)NC1CC1
: