Target
Mitogen-activated protein kinase 9
Ligand
BDBM50253154
Substrate
Meas. Tech.
ChEMBL_539862 (CHEMBL1025670)
IC50
5524±n/a nM
Citation
 Herberich, BCao, GQChakrabarti, PPFalsey, JRPettus, LRzasa, RMReed, ABReichelt, ASham, KThaman, MWurz, RPXu, SZhang, DHsieh, FLee, MRSyed, RLi, VGrosfeld, DPlant, MHHenkle, BSherman, LMiddleton, SWong, LMTasker, AS Discovery of highly selective and potent p38 inhibitors based on a phthalazine scaffold. J Med Chem 51:6271-9 (2008)  
Target
Name:
Mitogen-activated protein kinase 9
Synonyms:
JNK-55 JNK2/JNK3 MK09_HUMAN Mitogen-activated protein kinase 8/9 SAPK1A c-Jun N-terminal kinase 2 | c-Jun N-terminal kinase 2 (JNK2)
Type:
Enzyme
Mol. Mass.:
48131.49
Organism:
Homo sapiens (Human)
Description:
JNK-2 was purchased from Upstate Cell Signaling Solutions (formerly Upstate Biotechnology).
Residue:
424
  
Inhibitor
Name:
BDBM50253154
Synonyms:
CHEMBL492265 N-cyclopropyl-4-methyl-3-[1-(2-methylphenyl)phthalazin-6-yl]benzamide
Type:
Small organic molecule
Emp. Form.:
C26H23N3O
Mol. Mass.:
393.4803
SMILES:
Cc1ccccc1-c1nncc2cc(ccc12)-c1cc(ccc1C)C(=O)NC1CC1
: