Target
Gonadotropin-releasing hormone receptor
Ligand
BDBM50162007
Substrate
Meas. Tech.
ChEMBL_495152 (CHEMBL1008931)
IC50
2.8±n/a nM
Citation
 Chen, CWu, DGuo, ZXie, QReinhart, GJMadan, AWen, JChen, THuang, CQChen, MChen, YTucci, FCRowbottom, MPontillo, JZhu, YFWade, WSaunders, JBozigian, HStruthers, RS Discovery of sodium R-(+)-4-{2-[5-(2-fluoro-3-methoxyphenyl)-3-(2-fluoro-6-[trifluoromethyl]benzyl)-4-methyl-2,6-dioxo-3,6-dihydro-2H-pyrimidin-1-yl]-1-phenylethylamino}butyrate (elagolix), a potent and orally available nonpeptide antagonist of the human gonadotropin-releasing hormone receptor. J Med Chem 51:7478-85 (2009)  
Target
Name:
Gonadotropin-releasing hormone receptor
Synonyms:
GNRHR GRHR GnRH-R Gonadotropin-releasing hormone receptor | Gonadotropin-releasing hormone receptor (GnRH)
Type:
Enzyme
Mol. Mass.:
37749.45
Organism:
Homo sapiens (Human)
Description:
P30968
Residue:
328
  
Inhibitor
Name:
BDBM50162007
Synonyms:
(R)-1-(2,6-difluorobenzyl)-3-(2-amino-2-phenylethyl)-5-(2-fluoro-3-methoxyphenyl)-6-methylpyrimidine-2,4(1H,3H)-dione 3-[(2R)-amino-2-phenylethyl]-1-(2,6-difluorobenzyl)-5-(2-fluoro-3-methoxyphenyl)-6-methylpyrimidin-2,4-dione | CHEMBL179691
Type:
Small organic molecule
Emp. Form.:
C27H24F3N3O3
Mol. Mass.:
495.493
SMILES:
COc1cccc(c1F)-c1c(C)n(Cc2c(F)cccc2F)c(=O)n(C[C@H](N)c2ccccc2)c1=O
: