Target
Cytochrome P450 3A4
Ligand
BDBM50261243
Substrate
Meas. Tech.
ChEMBL_495153 (CHEMBL1008932)
IC50
230±n/a nM
Citation
 Chen, CWu, DGuo, ZXie, QReinhart, GJMadan, AWen, JChen, THuang, CQChen, MChen, YTucci, FCRowbottom, MPontillo, JZhu, YFWade, WSaunders, JBozigian, HStruthers, RS Discovery of sodium R-(+)-4-{2-[5-(2-fluoro-3-methoxyphenyl)-3-(2-fluoro-6-[trifluoromethyl]benzyl)-4-methyl-2,6-dioxo-3,6-dihydro-2H-pyrimidin-1-yl]-1-phenylethylamino}butyrate (elagolix), a potent and orally available nonpeptide antagonist of the human gonadotropin-releasing hormone receptor. J Med Chem 51:7478-85 (2009)  
Target
Name:
Cytochrome P450 3A4
Synonyms:
Albendazole monooxygenase CP3A4_HUMAN CYP3A4 CYPIIIA4 Cytochrome P450 3A4 (CYP3A4) Nifedipine oxidase Taurochenodeoxycholate 6-alpha-hydroxylase
Type:
Enzyme
Mol. Mass.:
57349.57
Organism:
Homo sapiens (Human)
Description:
Residue:
503
  
Inhibitor
Name:
BDBM50261243
Synonyms:
(R)-1-(2-fluoro-6-(trifluoromethyl)benzyl)-3-(2-amino-2-phenylethyl)-5-(2-fluoro-3-methoxyphenyl)-6-methylpyrimidine-2,4(1H,3H)-dione CHEMBL468551
Type:
Small organic molecule
Emp. Form.:
C28H24F5N3O3
Mol. Mass.:
545.5005
SMILES:
COc1cccc(c1F)-c1c(C)n(Cc2c(F)cccc2C(F)(F)F)c(=O)n(C[C@H](N)c2ccccc2)c1=O
: