Target
Prostaglandin E2 receptor EP3 subtype
Ligand
BDBM50254841
Substrate
Meas. Tech.
ChEMBL_558526 (CHEMBL963092)
IC50
0.3±n/a nM
Citation
 Zhou, NZeller, WKrohn, MAnderson, HZhang, JOnua, EKiselyov, ASRamirez, JHalldorsdottir, GAndrésson, TGurney, MESingh, J 3,4-Disubstituted indole acylsulfonamides: a novel series of potent and selective human EP3 receptor antagonists. Bioorg Med Chem Lett 19:123-6 (2008)  
Target
Name:
Prostaglandin E2 receptor EP3 subtype
Synonyms:
PE2R3_HUMAN PGE2-R Prostaglandin E2 receptor Prostaglandin E2 receptor EP3 subtype (EP3) Prostaglandin E2 receptor EP3D subtype (EP3D) | Prostanoid EP3 receptor
Type:
Enzyme
Mol. Mass.:
43335.03
Organism:
Homo sapiens (Human)
Description:
P43115
Residue:
390
  
Inhibitor
Name:
BDBM50254841
Synonyms:
2-(3-(3,4-dichlorophenylthio)-1H-indol-4-yloxy)-N-(4,5-dichlorothiophen-2-ylsulfonyl)acetamide | CHEMBL519598
Type:
Small organic molecule
Emp. Form.:
C20H12Cl4N2O4S3
Mol. Mass.:
582.327
SMILES:
Clc1cc(sc1Cl)S(=O)(=O)NC(=O)COc1cccc2[nH]cc(Sc3ccc(Cl)c(Cl)c3)c12
: