Target
Transient receptor potential cation channel subfamily V member 1
Ligand
BDBM50254322
Substrate
Meas. Tech.
ChEMBL_559247 (CHEMBL1014666)
IC50
14±n/a nM
Citation
 Lebsack, ADBranstetter, BJHack, MDXiao, WPeterson, MLNasser, NMaher, MPAo, HBhattacharya, AKansagara, MScott, BPLuo, LRynberg, RRizzolio, MChaplan, SRWickenden, ADGuy Breitenbucher, J Identification and synthesis of 2,7-diamino-thiazolo[5,4-d]pyrimidine derivatives as TRPV1 antagonists. Bioorg Med Chem Lett 19:40-6 (2008)  
Target
Name:
Transient receptor potential cation channel subfamily V member 1
Synonyms:
Capsaicin receptor Osm-9-like TRP channel 1 TRPV1_HUMAN Transient receptor potential cation channel subfamily V member 1 (TRPV1) Transient receptor potential cation channel subfamily V member 1(TRPV1) Vanilloid VR1 Vanilloid receptor 1 Vanilloid receptor 1 (VRI/TRPV1)
Type:
Protein
Mol. Mass.:
94960.75
Organism:
Homo sapiens (Human)
Description:
Q8NER1
Residue:
839
  
Inhibitor
Name:
BDBM50254322
Synonyms:
CHEMBL467007 | N2-(2,6-dichlorophenyl)-N7-(6-(trifluoromethyl)pyridin-3-yl)thiazolo[5,4-d]pyrimidine-2,7-diamine
Type:
Small organic molecule
Emp. Form.:
C17H9Cl2F3N6S
Mol. Mass.:
457.26
SMILES:
FC(F)(F)c1ccc(Nc2ncnc3sc(Nc4c(Cl)cccc4Cl)nc23)cn1
: