Target
Transient receptor potential cation channel subfamily V member 1
Ligand
BDBM50254154
Substrate
Meas. Tech.
ChEMBL_559247 (CHEMBL1014666)
IC50
9±n/a nM
Citation
 Lebsack, ADBranstetter, BJHack, MDXiao, WPeterson, MLNasser, NMaher, MPAo, HBhattacharya, AKansagara, MScott, BPLuo, LRynberg, RRizzolio, MChaplan, SRWickenden, ADGuy Breitenbucher, J Identification and synthesis of 2,7-diamino-thiazolo[5,4-d]pyrimidine derivatives as TRPV1 antagonists. Bioorg Med Chem Lett 19:40-6 (2008)  
Target
Name:
Transient receptor potential cation channel subfamily V member 1
Synonyms:
Capsaicin receptor Osm-9-like TRP channel 1 TRPV1_HUMAN Transient receptor potential cation channel subfamily V member 1 (TRPV1) Transient receptor potential cation channel subfamily V member 1(TRPV1) Vanilloid VR1 Vanilloid receptor 1 Vanilloid receptor 1 (VRI/TRPV1)
Type:
Protein
Mol. Mass.:
94960.75
Organism:
Homo sapiens (Human)
Description:
Q8NER1
Residue:
839
  
Inhibitor
Name:
BDBM50254154
Synonyms:
CHEMBL468470 | N2-(2-chloro-6-methylphenyl)-N7-(4-(trifluoromethyl)phenyl)thiazolo[5,4-d]pyrimidine-2,7-diamine
Type:
Small organic molecule
Emp. Form.:
C19H13ClF3N5S
Mol. Mass.:
435.853
SMILES:
Cc1cccc(Cl)c1Nc1nc2c(Nc3ccc(cc3)C(F)(F)F)ncnc2s1
: