Target
Transient receptor potential cation channel subfamily V member 1
Ligand
BDBM50254114
Substrate
Meas. Tech.
ChEMBL_559247 (CHEMBL1014666)
IC50
15±n/a nM
Citation
 Lebsack, ADBranstetter, BJHack, MDXiao, WPeterson, MLNasser, NMaher, MPAo, HBhattacharya, AKansagara, MScott, BPLuo, LRynberg, RRizzolio, MChaplan, SRWickenden, ADGuy Breitenbucher, J Identification and synthesis of 2,7-diamino-thiazolo[5,4-d]pyrimidine derivatives as TRPV1 antagonists. Bioorg Med Chem Lett 19:40-6 (2008)  
Target
Name:
Transient receptor potential cation channel subfamily V member 1
Synonyms:
Capsaicin receptor Osm-9-like TRP channel 1 TRPV1_HUMAN Transient receptor potential cation channel subfamily V member 1 (TRPV1) Transient receptor potential cation channel subfamily V member 1(TRPV1) Vanilloid VR1 Vanilloid receptor 1 Vanilloid receptor 1 (VRI/TRPV1)
Type:
Protein
Mol. Mass.:
94960.75
Organism:
Homo sapiens (Human)
Description:
Q8NER1
Residue:
839
  
Inhibitor
Name:
BDBM50254114
Synonyms:
CHEMBL461658 | N-(4-(trifluoromethyl)phenyl)-7-(3-(trifluoromethyl)pyridin-2-yl)-5,6,7,8-tetrahydropyrido[3,4-d]pyrimidin-4-amine
Type:
Small organic molecule
Emp. Form.:
C20H15F6N5
Mol. Mass.:
439.357
SMILES:
FC(F)(F)c1ccc(Nc2ncnc3CN(CCc23)c2ncccc2C(F)(F)F)cc1
: