Target
Transient receptor potential cation channel subfamily V member 1
Ligand
BDBM50254154
Substrate
Meas. Tech.
ChEMBL_559248 (CHEMBL1014667)
IC50
1.6±n/a nM
Citation
 Lebsack, ADBranstetter, BJHack, MDXiao, WPeterson, MLNasser, NMaher, MPAo, HBhattacharya, AKansagara, MScott, BPLuo, LRynberg, RRizzolio, MChaplan, SRWickenden, ADGuy Breitenbucher, J Identification and synthesis of 2,7-diamino-thiazolo[5,4-d]pyrimidine derivatives as TRPV1 antagonists. Bioorg Med Chem Lett 19:40-6 (2008)  
Target
Name:
Transient receptor potential cation channel subfamily V member 1
Synonyms:
Capsaicin receptor TRPV1_RAT Trpv1 Vanilloid VR1 Vanilloid receptor 1 (VRI/TRPV1) Vanilloid receptor type 1-like (TrpV1/Vr1) Vr1l | osm-9-like TRP channel 1
Type:
Transient Receptor
Mol. Mass.:
94956.12
Organism:
Rattus norvegicus (rat)
Description:
O35433
Residue:
838
  
Inhibitor
Name:
BDBM50254154
Synonyms:
CHEMBL468470 | N2-(2-chloro-6-methylphenyl)-N7-(4-(trifluoromethyl)phenyl)thiazolo[5,4-d]pyrimidine-2,7-diamine
Type:
Small organic molecule
Emp. Form.:
C19H13ClF3N5S
Mol. Mass.:
435.853
SMILES:
Cc1cccc(Cl)c1Nc1nc2c(Nc3ccc(cc3)C(F)(F)F)ncnc2s1
: