Target
Neuropeptide Y receptor type 1
Ligand
BDBM50246646
Substrate
Meas. Tech.
ChEMBL_562270 (CHEMBL1011813)
Kd
1.2±n/a nM
Citation
 Keller, MPop, NHutzler, CBeck-Sickinger, AGBernhardt, GBuschauer, A Guanidine-acylguanidine bioisosteric approach in the design of radioligands: synthesis of a tritium-labeled N(G)-propionylargininamide ([3H]-UR-MK114) as a highly potent and selective neuropeptide Y Y1 receptor antagonist. J Med Chem 51:8168-72 (2008)  
Target
Name:
Neuropeptide Y receptor type 1
Synonyms:
NPY-Y1 NPY1R NPYR neuropeptide Y receptor Y1
Type:
Enzyme Catalytic Domain
Mol. Mass.:
44399.07
Organism:
Homo sapiens (Human)
Description:
NPY-Y1 NPY1R HUMAN::P25929
Residue:
384
  
Inhibitor
Name:
BDBM50246646
Synonyms:
(R)-Nalpha-(2,2-diphenylacetyl)-N-(4-hydroxybenzyl)-N-omega-propanoylargininamide CHEMBL470495
Type:
Small organic molecule
Emp. Form.:
C30H35N5O4
Mol. Mass.:
529.63
SMILES:
CCC(=O)NC(N)=NCCC[C@@H](NC(=O)C(c1ccccc1)c1ccccc1)C(=O)NCc1ccc(O)cc1
: