Target
Cytochrome P450 2C9
Ligand
BDBM50256169
Substrate
Meas. Tech.
ChEMBL_515053 (CHEMBL1034795)
IC50
9200±n/a nM
Citation
 Sparks, SMBanker, PBickett, DMCarter, HLClancy, DCDickerson, SHDwornik, KAGarrido, DMGolden, PLNolte, RTPeat, AJSheckler, LRTavares, FXThomson, SAWang, LWeiel, JE Anthranilimide-based glycogen phosphorylase inhibitors for the treatment of type 2 diabetes: 1. Identification of 1-amino-1-cycloalkyl carboxylic acid headgroups. Bioorg Med Chem Lett 19:976-80 (2009)  
Target
Name:
Cytochrome P450 2C9
Synonyms:
(R)-limonene 6-monooxygenase CP2C9_HUMAN CYP2C9 Cytochrome P450 2C9 (CYP2C9 ) P-450MP P450 PB-1 | S-mephenytoin 4-hydroxylase
Type:
Enzyme
Mol. Mass.:
55636.33
Organism:
Homo sapiens (Human)
Description:
P11712
Residue:
490
  
Inhibitor
Name:
BDBM50256169
Synonyms:
(S)-2-cyclohexyl-2-(3-(3-mesitylureido)-2-naphthamido)propanoic acid CHEMBL482146
Type:
Small organic molecule
Emp. Form.:
C30H35N3O4
Mol. Mass.:
501.6166
SMILES:
Cc1cc(C)c(NC(=O)Nc2cc3ccccc3cc2C(=O)N[C@@](C)(C2CCCCC2)C(O)=O)c(C)c1
: