Target
Vascular endothelial growth factor receptor 2
Ligand
BDBM50277407
Substrate
Meas. Tech.
ChEMBL_540595 (CHEMBL1036678)
Ki
90±n/a nM
Citation
 Kiselyov, ASSemenova, MSemenov, VV 3,4-Disubstituted isothiazoles: novel potent inhibitors of VEGF receptors 1 and 2. Bioorg Med Chem Lett 19:1195-8 (2009)  
Target
Name:
Vascular endothelial growth factor receptor 2
Synonyms:
CD_antigen=CD309 Fetal liver kinase 1 (FLK-1) KDR Protein-tyrosine kinase receptor Flk-1 VEGFR-2 VEGFR2 Vascular Endothelial Growth Factor Receptor Kinase 2 Vascular endothelial growth factor receptor 2 (KDR) Vascular endothelial growth factor receptor 2 (VEGFR2) Vascular endothelial growth factor receptor-2 (VEGFR-2)
Type:
Receptor Tyrosine Kinase
Mol. Mass.:
151510.97
Organism:
Homo sapiens (Human)
Description:
P35968
Residue:
1356
  
Inhibitor
Name:
BDBM50277407
Synonyms:
CHEMBL473288 | N-(4-bromophenyl)-4-(pyridin-4-ylmethylamino)isothiazole-3-carboxamide
Type:
Small organic molecule
Emp. Form.:
C16H13BrN4OS
Mol. Mass.:
389.27
SMILES:
Brc1ccc(NC(=O)c2nscc2NCc2ccncc2)cc1
: