Target
Adenosine receptor A2a
Ligand
BDBM50248433
Substrate
Meas. Tech.
ChEMBL_543474 (CHEMBL1018640)
Ki
4±n/a nM
Citation
 Shao, YCole, AGBrescia, MRQin, LYDuo, JStauffer, TMRokosz, LLMcGuinness, BFHenderson, I Synthesis and SAR studies of trisubstituted purinones as potent and selective adenosine A2A receptor antagonists. Bioorg Med Chem Lett 19:1399-402 (2009)  
Target
Name:
Adenosine receptor A2a
Synonyms:
A2A adenosine receptor (hA2A) ADENOSINE A2 ADORA2 Adenosine A2A receptor (A2AAR)
Type:
G Protein-Coupled Receptor (GPCR)
Mol. Mass.:
44716.46
Organism:
Homo sapiens (Human)
Description:
P29274
Residue:
412
  
Inhibitor
Name:
BDBM50248433
Synonyms:
2-(cyclopropylamino)-7-(2,6-difluorobenzyl)-9-(3-methoxyphenyl)-7H-purin-8(9H)-one | CHEMBL489126
Type:
Small organic molecule
Emp. Form.:
C22H19F2N5O2
Mol. Mass.:
423.4154
SMILES:
COc1cccc(c1)-n1c2nc(NC3CC3)ncc2n(Cc2c(F)cccc2F)c1=O
: