Target
Vascular endothelial growth factor receptor 2
Ligand
BDBM50248584
Substrate
Meas. Tech.
ChEMBL_565919 (CHEMBL960814)
Ki
160±n/a nM
Citation
 Kiselyov, ASSemenova, MSemenov, VV (1,2,3-Triazol-4-yl)benzenamines: synthesis and activity against VEGF receptors 1 and 2. Bioorg Med Chem Lett 19:1344-8 (2009)  
Target
Name:
Vascular endothelial growth factor receptor 2
Synonyms:
CD_antigen=CD309 Fetal liver kinase 1 (FLK-1) KDR Protein-tyrosine kinase receptor Flk-1 VEGFR-2 VEGFR2 Vascular Endothelial Growth Factor Receptor Kinase 2 Vascular endothelial growth factor receptor 2 (KDR) Vascular endothelial growth factor receptor 2 (VEGFR2) Vascular endothelial growth factor receptor-2 (VEGFR-2)
Type:
Receptor Tyrosine Kinase
Mol. Mass.:
151510.97
Organism:
Homo sapiens (Human)
Description:
P35968
Residue:
1356
  
Inhibitor
Name:
BDBM50248584
Synonyms:
2-(1-(3-isopropylphenyl)-1H-1,2,3-triazol-4-yl)-N-(pyridin-4-ylmethyl)aniline | CHEMBL518652
Type:
Small organic molecule
Emp. Form.:
C23H23N5
Mol. Mass.:
369.4622
SMILES:
CC(C)c1cccc(c1)-n1cc(nn1)-c1ccccc1NCc1ccncc1
: