Target
Vascular endothelial growth factor receptor 2
Ligand
BDBM50248494
Substrate
Meas. Tech.
ChEMBL_565920 (CHEMBL960815)
Ki
80±n/a nM
Citation
 Kiselyov, ASSemenova, MSemenov, VV (1,2,3-Triazol-4-yl)benzenamines: synthesis and activity against VEGF receptors 1 and 2. Bioorg Med Chem Lett 19:1344-8 (2009)  
Target
Name:
Vascular endothelial growth factor receptor 2
Synonyms:
CD_antigen=CD309 Fetal liver kinase 1 (FLK-1) KDR Protein-tyrosine kinase receptor Flk-1 VEGFR-2 VEGFR2 Vascular Endothelial Growth Factor Receptor Kinase 2 Vascular endothelial growth factor receptor 2 (KDR) Vascular endothelial growth factor receptor 2 (VEGFR2) Vascular endothelial growth factor receptor-2 (VEGFR-2)
Type:
Receptor Tyrosine Kinase
Mol. Mass.:
151510.97
Organism:
Homo sapiens (Human)
Description:
P35968
Residue:
1356
  
Inhibitor
Name:
BDBM50248494
Synonyms:
CHEMBL490968 | N-(Pyridin-4-ylmethyl)-2-(1-(3-(trifluoromethyl)phenyl)-1H-1,2,3-triazol-4-yl)benzenamine
Type:
Small organic molecule
Emp. Form.:
C21H16F3N5
Mol. Mass.:
395.3804
SMILES:
FC(F)(F)c1cccc(c1)-n1cc(nn1)-c1ccccc1NCc1ccncc1
: