Target
Neuronal acetylcholine receptor subunit alpha-4
Ligand
BDBM50247983
Substrate
Meas. Tech.
ChEMBL_566265 (CHEMBL953568)
IC50
7943.28±n/a nM
Citation
 Enz, AFeuerbach, DFrederiksen, MUGentsch, CHurth, KMüller, WNozulak, JRoy, BL Gamma-lactams--a novel scaffold for highly potent and selective alpha 7 nicotinic acetylcholine receptor agonists. Bioorg Med Chem Lett 19:1287-91 (2009)  
Target
Name:
Neuronal acetylcholine receptor subunit alpha-4
Synonyms:
ACHA4_HUMAN CHRNA4 protein Neuronal acetylcholine receptor protein alpha-4 subunit Nicotinic acetylcholine receptor alpha4/beta2/alpha5
Type:
Mol. Mass.:
69963.49
Organism:
Homo sapiens (Human)
Description:
NACHRA4
Residue:
627
  
Inhibitor
Name:
BDBM50247983
Synonyms:
CHEMBL454407 | cis-1-methyl-5-(phenylethynyl)-3-(piperidin-1-ylmethyl)pyrrolidin-2-one
Type:
Small organic molecule
Emp. Form.:
C19H24N2O
Mol. Mass.:
296.4067
SMILES:
CN1[C@@H](C[C@H](CN2CCCCC2)C1=O)C#Cc1ccccc1
: