Target
5-hydroxytryptamine receptor 3A
Ligand
BDBM50247983
Substrate
Meas. Tech.
ChEMBL_566267 (CHEMBL953570)
IC50
251188.64±n/a nM
Citation
 Enz, AFeuerbach, DFrederiksen, MUGentsch, CHurth, KMüller, WNozulak, JRoy, BL Gamma-lactams--a novel scaffold for highly potent and selective alpha 7 nicotinic acetylcholine receptor agonists. Bioorg Med Chem Lett 19:1287-91 (2009)  
Target
Name:
5-hydroxytryptamine receptor 3A
Synonyms:
5-HT-3 5-HT3A 5-hydroxytryptamine receptor 3 (5-HT3) 5-hydroxytryptamine receptor 3A (5HT3A) 5HT3R HTR3A Serotonin 3 receptor (5HT3) Serotonin-gated ion channel receptor | Serotonin-gated ion channel receptor 3
Type:
Protein
Mol. Mass.:
55283.27
Organism:
Homo sapiens (Human)
Description:
P46098
Residue:
478
  
Inhibitor
Name:
BDBM50247983
Synonyms:
CHEMBL454407 | cis-1-methyl-5-(phenylethynyl)-3-(piperidin-1-ylmethyl)pyrrolidin-2-one
Type:
Small organic molecule
Emp. Form.:
C19H24N2O
Mol. Mass.:
296.4067
SMILES:
CN1[C@@H](C[C@H](CN2CCCCC2)C1=O)C#Cc1ccccc1
: