Target
Dipeptidyl peptidase 4
Ligand
BDBM50278778
Substrate
Meas. Tech.
ChEMBL_501197 (CHEMBL975310)
IC50
>30000±n/a nM
Citation
 Benbow, JWAndrews, KAAubrecht, JBeebe, DBoyer, DDoran, SHomiski, MHui, YMcPherson, KParker, JCTreadway, JVanvolkenberg, MZembrowski, WJ Piperidinyl-2-phenethylamino inhibitors of DPP-IV for the treatment of type 2 diabetes. Bioorg Med Chem Lett 19:2220-3 (2009)  
Target
Name:
Dipeptidyl peptidase 4
Synonyms:
ADABP Adenosine deaminase complexing protein 2 CD_antigen=CD26 DPP4 DPPIV Dipeptidyl peptidase 4 (DPP IV) Dipeptidyl peptidase 4 (DPP4) Dipeptidyl peptidase 4 membrane form Dipeptidyl peptidase IV Dipeptidyl peptidase IV (DDP-IV) Dipeptidyl peptidase IV membrane form Dipeptidyl peptidase-IV (DPP-4) T-cell activation antigen CD26 | TP103
Type:
Enzyme
Mol. Mass.:
88271.01
Organism:
Homo sapiens (Human)
Description:
P27487
Residue:
766
  
Inhibitor
Name:
BDBM50278778
Synonyms:
(S)-methyl 4-(1-amino-2-(2,4,5-trifluorophenyl)ethyl)benzoate | CHEMBL471648
Type:
Small organic molecule
Emp. Form.:
C16H14F3NO2
Mol. Mass.:
309.2831
SMILES:
COC(=O)c1ccc(cc1)[C@@H](N)Cc1cc(F)c(F)cc1F
: