Target
Dual specificity calcium/calmodulin-dependent 3',5'-cyclic nucleotide phosphodiesterase 1A
Ligand
BDBM50059035
Substrate
Meas. Tech.
ChEMBL_497579 (CHEMBL999426)
IC50
10000±n/a nM
Citation
 Akama, TBaker, SJZhang, YKHernandez, VZhou, HSanders, VFreund, YKimura, RMaples, KRPlattner, JJ Discovery and structure-activity study of a novel benzoxaborole anti-inflammatory agent (AN2728) for the potential topical treatment of psoriasis and atopic dermatitis. Bioorg Med Chem Lett 19:2129-32 (2009)  
Target
Name:
Dual specificity calcium/calmodulin-dependent 3',5'-cyclic nucleotide phosphodiesterase 1A
Synonyms:
61 kDa Cam-PDE Cam-PDE 1A PDE1A_HUMAN | hCam-1
Type:
Protein
Mol. Mass.:
61245.69
Organism:
Homo sapiens (Human)
Description:
P54750
Residue:
535
  
Inhibitor
Name:
BDBM50059035
Synonyms:
3-Isobutyl-8-methoxymethyl-1-methyl-3,7-dihydro-purine-2,6-dione 3-isobutyl-8-(methoxymethyl)-1-methyl-1H-purine-2,6(3H,7H)-dione | CHEMBL307639
Type:
Small organic molecule
Emp. Form.:
C12H18N4O3
Mol. Mass.:
266.2963
SMILES:
COCc1nc2n(CC(C)C)c(=O)n(C)c(=O)c2[nH]1
: