Target
High affinity cAMP-specific 3',5'-cyclic phosphodiesterase 7A
Ligand
BDBM50277784
Substrate
Meas. Tech.
ChEMBL_497592 (CHEMBL999439)
IC50
2200±n/a nM
Citation
 Akama, TBaker, SJZhang, YKHernandez, VZhou, HSanders, VFreund, YKimura, RMaples, KRPlattner, JJ Discovery and structure-activity study of a novel benzoxaborole anti-inflammatory agent (AN2728) for the potential topical treatment of psoriasis and atopic dermatitis. Bioorg Med Chem Lett 19:2129-32 (2009)  
Target
Name:
High affinity cAMP-specific 3',5'-cyclic phosphodiesterase 7A
Synonyms:
3',5'-cyclic phosphodiesterase PDE7A_HUMAN Phosphodiesterase 7 (PDE7) Phosphodiesterase 7A (PDE7A1)
Type:
Enzyme
Mol. Mass.:
55514.96
Organism:
Homo sapiens (Human)
Description:
Q13946
Residue:
482
  
Inhibitor
Name:
BDBM50277784
Synonyms:
CHEMBL484928 | N,N,2-trimethyl-5-nitrobenzenesulfonamide
Type:
Small organic molecule
Emp. Form.:
C9H12N2O4S
Mol. Mass.:
244.268
SMILES:
CN(C)S(=O)(=O)c1cc(ccc1C)[N+]([O-])=O
: