Target
Cholesteryl ester transfer protein
Ligand
BDBM50277885
Substrate
Meas. Tech.
ChEMBL_501358 (CHEMBL1010541)
IC50
39±n/a nM
Citation
 Rano, TASieber-McMaster, EPelton, PDYang, MDemarest, KTKuo, GH Design and synthesis of potent inhibitors of cholesteryl ester transfer protein (CETP) exploiting a 1,2,3,4-tetrahydroquinoline platform. Bioorg Med Chem Lett 19:2456-60 (2009)  
Target
Name:
Cholesteryl ester transfer protein
Synonyms:
CETP Cholesteryl ester transfer protein (CETP) | Lipid transfer protein I
Type:
Enzyme
Mol. Mass.:
54751.53
Organism:
Homo sapiens (Human)
Description:
P11597
Residue:
493
  
Inhibitor
Name:
BDBM50277885
Synonyms:
CHEMBL490868 | Tetrahydroquinline A
Type:
Small organic molecule
Emp. Form.:
C26H20F9NO3
Mol. Mass.:
565.4275
SMILES:
O[C@@H](CN1[C@H](CCc2c1cccc2-c1cccc(OC(F)(F)F)c1)c1cccc(OC(F)(F)F)c1)C(F)(F)F
: