Target
Amine oxidase [flavin-containing] B
Ligand
BDBM11022
Substrate
Meas. Tech.
ChEMBL_500941 (CHEMBL972369)
Ki
3000±n/a nM
Citation
 Van der Walt, EMMilczek, EMMalan, SFEdmondson, DECastagnoli, NBergh, JJPetzer, JP Inhibition of monoamine oxidase by (E)-styrylisatin analogues. Bioorg Med Chem Lett 19:2509-13 (2009)  
Target
Name:
Amine oxidase [flavin-containing] B
Synonyms:
AOFB_HUMAN MAOB Monoamine oxidase type B (MAO B) Monoamine oxidase type B (MAOB)
Type:
Protein
Mol. Mass.:
58768.76
Organism:
Homo sapiens (Human)
Description:
P27338
Residue:
520
  
Inhibitor
Name:
BDBM11022
Synonyms:
2,3-dihydro-1H-indole-2,3-dione Isatin | Isatin (Compound 1)
Type:
Small organic molecule
Emp. Form.:
C8H5NO2
Mol. Mass.:
147.1308
SMILES:
O=C1Nc2ccccc2C1=O
: