Target
Renin
Ligand
BDBM50280236
Substrate
Meas. Tech.
ChEMBL_195923 (CHEMBL803392)
pH
6±n/a
IC50
1.2±n/a nM
Comments
extracted
Citation
 Baker, WRJae, HSMartin, SRCondon, SLStein, HHCohen, JKleinert, HD Conformationally restricted peptide isosteres. 2.1 Synthesis and in vitro potency of dipeptide renin inhibitors employing a 2-alkylsulfonyl-3-phenylcyclopropane carboxamide as a P3 amino acid replacement Bioorg Med Chem Lett 2:1405-1410 (1992)    Article 
Target
Name:
Renin
Synonyms:
Angiotensinogenase RENI_HUMAN
Type:
Enzyme
Mol. Mass.:
45058.99
Organism:
Homo sapiens (Human)
Description:
Residue:
406
  
Inhibitor
Name:
BDBM50280236
Synonyms:
(1S,2R,3S)-2-Benzenesulfonyl-3-phenyl-cyclopropanecarboxylic acid [(S)-1-((1S,2R,3S)-1-cyclohexylmethyl-2,3-dihydroxy-5-methyl-hexylcarbamoyl)-2-thiazol-4-yl-ethyl]-amide | CHEMBL281985
Type:
Small organic molecule
Emp. Form.:
C36H47N3O6S2
Mol. Mass.:
681.905
SMILES:
CC(C)C[C@H](O)[C@H](O)[C@H](CC1CCCCC1)NC(=O)[C@H](Cc1cscn1)NC(=O)[C@@H]1[C@H]([C@H]1S(=O)(=O)c1ccccc1)c1ccccc1
: