Target
Renin
Ligand
BDBM50280238
Substrate
Meas. Tech.
ChEMBL_195923 (CHEMBL803392)
pH
6±n/a
IC50
2.5±n/a nM
Comments
extracted
Citation
 Baker, WRJae, HSMartin, SRCondon, SLStein, HHCohen, JKleinert, HD Conformationally restricted peptide isosteres. 2.1 Synthesis and in vitro potency of dipeptide renin inhibitors employing a 2-alkylsulfonyl-3-phenylcyclopropane carboxamide as a P3 amino acid replacement Bioorg Med Chem Lett 2:1405-1410 (1992)    Article 
Target
Name:
Renin
Synonyms:
Angiotensinogenase RENI_HUMAN
Type:
Enzyme
Mol. Mass.:
45058.99
Organism:
Homo sapiens (Human)
Description:
Residue:
406
  
Inhibitor
Name:
BDBM50280238
Synonyms:
(1R,2R,3S)-2-Phenyl-3-(propane-2-sulfonyl)-cyclopropanecarboxylic acid [(S)-1-((1S,2R,3S)-1-cyclohexylmethyl-2,3-dihydroxy-5-methyl-hexylcarbamoyl)-2-imidazol-1-yl-ethyl]-amide | CHEMBL30495
Type:
Small organic molecule
Emp. Form.:
C33H50N4O6S
Mol. Mass.:
630.838
SMILES:
CC(C)C[C@H](O)[C@H](O)[C@H](CC1CCCCC1)NC(=O)[C@H](Cn1ccnc1)NC(=O)[C@H]1[C@@H]([C@@H]1S(=O)(=O)C(C)C)c1ccccc1
: