Target
Type-1 angiotensin II receptor
Ligand
BDBM50011977
Substrate
Meas. Tech.
ChEMBL_35258 (CHEMBL648564)
IC50
7.3±n/a nM
Citation
 Weinstock, JHill, DTKeenan, RMFranz, RGGaitanopoulos, DEGirard, GREggleston, DSAiyar, NGriffin, EOhlstein, EBrooks, DPGellai, MFrederickson, TAWeidley, EFEdwards, RM A potent long-acting imidazole-5-acrylic acid angiotensin II AT-1 receptor antagonist Bioorg Med Chem Lett 4:23-28 (1994)    Article 
Target
Name:
Type-1 angiotensin II receptor
Synonyms:
AGTR1 AGTR1B AT1 AT1BR AT2R1B Angiotensin II receptor Type-1 angiotensin II receptor (AT1)
Type:
Protein
Mol. Mass.:
41080.75
Organism:
Homo sapiens (Human)
Description:
P30556
Residue:
359
  
Inhibitor
Name:
BDBM50011977
Synonyms:
(E)-2-butyl-1-(p-carboxybenzyl)-alpha-2-thenylimidazole-5-acrylic acid (E)-alpha{[2-butyl-1-[(4-carboxyphenyl)methyl]-1H-imidazole-5-yl]methylene}-2-thiopheneproprionic acid CHEMBL813 | EPROSARTAN
Type:
Small organic molecule
Emp. Form.:
C23H24N2O4S
Mol. Mass.:
424.513
SMILES:
CCCCc1ncc(\C=C(/Cc2cccs2)C(O)=O)n1Cc1ccc(cc1)C(O)=O
: